Target
Adenosine receptor A3
Ligand
BDBM50423872
Substrate
Meas. Tech.
ChEMBL_817485 (CHEMBL2027708)
Kd
3.4±n/a nM
Citation
 Vernall, AJStoddart, LABriddon, SJHill, SJKellam, B Highly potent and selective fluorescent antagonists of the human adenosine A3 receptor based on the 1,2,4-triazolo[4,3-a]quinoxalin-1-one scaffold. J Med Chem 55:1771-82 (2012)  
Target
Name:
Adenosine receptor A3
Synonyms:
A3 adenosine receptor (hA3) ADORA3 | Adenosine A3 receptor (A3AR)
Type:
G Protein-Coupled Receptor (GPCR)
Mol. Mass.:
36197.32
Organism:
Homo sapiens (Human)
Description:
P0DMS8
Residue:
318
  
Inhibitor
Name:
BDBM50423872
Synonyms:
CHEMBL2024150
Type:
Small organic molecule
Emp. Form.:
C53H55BF2N10O9S
Mol. Mass.:
1056.938
SMILES:
COc1ccc(cc1)-n1nc2c(NC(=O)CCC(=O)NCCOCCOCCNC(=O)CCCCCNC(=O)COc3ccc(cc3)C3=[N+]4C(C=C3)=Cc3ccc(-c5cccs5)n3[B-]4(F)F)nc3ccccc3n2c1=O
: