Target
Muscarinic acetylcholine receptor M1
Ligand
BDBM50424120
Substrate
Meas. Tech.
ChEMBL_937315 (CHEMBL2319078)
IC50
478±n/a nM
Citation
 Sheffler, DJSevel, CLe, ULovell, KMTarr, JCCarrington, SJCho, HPDigby, GJNiswender, CMConn, PJHopkins, CRWood, MRLindsley, CW Further exploration of M1 allosteric agonists: subtle structural changes abolish M1 allosteric agonism and result in pan-mAChR orthosteric antagonism. Bioorg Med Chem Lett 23:223-7 (2012)  
Target
Name:
Muscarinic acetylcholine receptor M1
Synonyms:
ACM1_RAT Chrm-1 cholinergic receptor, muscarinic 1
Type:
Enzyme Catalytic Domain
Mol. Mass.:
51390.46
Organism:
RAT
Description:
P08482
Residue:
460
  
Inhibitor
Name:
BDBM50424120
Synonyms:
CHEMBL2315677
Type:
Small organic molecule
Emp. Form.:
C20H29N3O3
Mol. Mass.:
359.4626
SMILES:
CCOC(=O)N1CCC(CC1)N[C@H]1CCCN(C1)C(=O)c1ccccc1
: