Target
Glucose-dependent insulinotropic receptor
Ligand
BDBM50424558
Substrate
Meas. Tech.
ChEMBL_933672 (CHEMBL2320533)
Ki
486±n/a nM
Citation
 Darout, ERobinson, RPMcClure, KFCorbett, MLi, BShavnya, AAndrews, MPJones, CSLi, QMinich, MLMascitti, VGuimarães, CRMunchhof, MJBahnck, KBCai, CPrice, DALiras, SBonin, PDCornelius, PWang, RBagdasarian, VSobota, CPHornby, SMasterson, VMJoseph, RMKalgutkar, ASChen, Y Design and synthesis of diazatricyclodecane agonists of the G-protein-coupled receptor 119. J Med Chem 56:301-19 (2013)  
Target
Name:
Glucose-dependent insulinotropic receptor
Synonyms:
G-protein coupled receptor 119 (GPR119) GPR119 | Glucose-dependent insulinotropic receptor
Type:
Protein
Mol. Mass.:
36901.49
Organism:
Homo sapiens (Human)
Description:
Q8TDV5
Residue:
335
  
Inhibitor
Name:
BDBM50424558
Synonyms:
CHEMBL2312524
Type:
Small organic molecule
Emp. Form.:
C24H31N5O3
Mol. Mass.:
437.5346
SMILES:
Cc1ncccc1Oc1ncnc(N2C3CC4CC2CC(C3)N4C(=O)OC(C)(C)C)c1C
: