Target
Dual specificity protein phosphatase 3
Ligand
BDBM50425817
Substrate
Meas. Tech.
ChEMBL_937598 (CHEMBL2321067)
IC50
>30000±n/a nM
Citation
 He, YXu, JYu, ZHGunawan, AMWu, LWang, LZhang, ZY Discovery and evaluation of novel inhibitors of mycobacterium protein tyrosine phosphatase B from the 6-Hydroxy-benzofuran-5-carboxylic acid scaffold. J Med Chem 56:832-42 (2013)  
Target
Name:
Dual specificity protein phosphatase 3
Synonyms:
DUS3_HUMAN Dual specificity protein phosphatase (VHR) Dual specificity protein phosphatase VHR Tyrosine-protein phosphatase non-receptor type 1 | VHR
Type:
Hydrolase
Mol. Mass.:
20480.58
Organism:
Homo sapiens (Human)
Description:
Residue:
185
  
Inhibitor
Name:
BDBM50425817
Synonyms:
CHEMBL2316909
Type:
Small organic molecule
Emp. Form.:
C24H16O5
Mol. Mass.:
384.3808
SMILES:
COc1cccc(c1)C#Cc1c(oc2cc(O)c(cc12)C(O)=O)-c1ccccc1
: