Target
Kynurenine--oxoglutarate transaminase 3
Ligand
BDBM50386310
Substrate
Meas. Tech.
ChEMBL_939752 (CHEMBL2329105)
IC50
6400±n/a nM
Citation
 Tuttle, JBAnderson, MBechle, BMCampbell, BMChang, CDounay, ABEvrard, EFonseca, KRGan, XGhosh, SHorner, WJames, LCKim, JYMcAllister, LAPandit, JParikh, VDRago, BJSalafia, MAStrick, CAZawadzke, LEVerhoest, PR Structure-Based Design of Irreversible Human KAT II Inhibitors: Discovery of New Potency-Enhancing Interactions. ACS Med Chem Lett 4:37-40 (2013)  
Target
Name:
Kynurenine--oxoglutarate transaminase 3
Synonyms:
CCBL2 KAT3 KATIII Kynurenine aminotransferase III Kynurenine--oxoglutarate transaminase III
Type:
PROTEIN
Mol. Mass.:
51406.81
Organism:
Homo sapiens (Human)
Description:
ChEMBL_939752
Residue:
454
  
Inhibitor
Name:
BDBM50386310
Synonyms:
CHEMBL2049092
Type:
Small organic molecule
Emp. Form.:
C10H12N2O3
Mol. Mass.:
208.2139
SMILES:
COc1ccc2C[C@H](N)C(=O)N(O)c2c1
: