Target
5-hydroxytryptamine receptor 2A
Ligand
BDBM50426498
Substrate
Meas. Tech.
ChEMBL_938241 (CHEMBL2328664)
IC50
11500±n/a nM
Citation
 Dosa, PIWard, TWalters, MAKim, SW Synthesis of novel analogs of cabergoline: improving cardiovascular safety by removing 5-HT2B receptor agonism. ACS Med Chem Lett 4:254-258 (2013)  
Target
Name:
5-hydroxytryptamine receptor 2A
Synonyms:
5-HT-2 5-HT2A 5-hydroxytryptamine receptor 2A (5HT-2A) 5HT2A_HUMAN HTR2A | Serotonin receptor 2A
Type:
undefined
Mol. Mass.:
52607.65
Organism:
Homo sapiens (Human)
Description:
P28223
Residue:
471
  
Inhibitor
Name:
BDBM50426498
Synonyms:
1,6-Dimethylcabergoline | CHEMBL2323579
Type:
Small organic molecule
Emp. Form.:
C25H37N5O2
Mol. Mass.:
439.5936
SMILES:
CCNC(=O)N(CCCN(C)C)C(=O)[C@@H]1C[C@H]2[C@@H](Cc3cn(C)c4cccc2c34)N(C)C1
: