Target
Acetyl-CoA carboxylase 2
Ligand
BDBM50426521
Substrate
Meas. Tech.
ChEMBL_938402 (CHEMBL2329345)
IC50
1.3±n/a nM
Citation
 Abdel-Magid, AF Treatment of Obesity and Related Disorders with Acetyl-CoA Carboxylase Inhibitors. ACS Med Chem Lett 4:16-7 (2013)  
Target
Name:
Acetyl-CoA carboxylase 2
Synonyms:
ACACB ACC-beta ACCB Acetyl-CoA carboxylase 2 Acetyl-CoA carboxylase 2 (ACC2)
Type:
Protein
Mol. Mass.:
276535.21
Organism:
Homo sapiens (Human)
Description:
O00763
Residue:
2458
  
Inhibitor
Name:
BDBM50426521
Synonyms:
CHEMBL2323626
Type:
Small organic molecule
Emp. Form.:
C26H31N5O2
Mol. Mass.:
445.5566
SMILES:
CNc1ccc2ccc(cc2n1)C(=O)N1CCC2(CC1)Cc1cn(nc1C(=O)C2)C(C)(C)C
: