Target
5-hydroxytryptamine receptor 2A
Ligand
BDBM50428890
Substrate
Meas. Tech.
ChEMBL_946126 (CHEMBL2343054)
Ki
0.910000±n/a nM
Citation
 Jensen, AAPlath, NPedersen, MHIsberg, VKrall, JWellendorph, PStensbøl, TBGloriam, DEKrogsgaard-Larsen, PFrølund, B Design, synthesis, and pharmacological characterization of N- and O-substituted 5,6,7,8-tetrahydro-4H-isoxazolo[4,5-d]azepin-3-ol analogues: novel 5-HT(2A)/5-HT(2C) receptor agonists with pro-cognitive properties. J Med Chem 56:1211-27 (2013)  
Target
Name:
5-hydroxytryptamine receptor 2A
Synonyms:
5-HT-2 5-HT2A 5-hydroxytryptamine receptor 2A (5HT-2A) 5HT2A_HUMAN HTR2A | Serotonin receptor 2A
Type:
undefined
Mol. Mass.:
52607.65
Organism:
Homo sapiens (Human)
Description:
P28223
Residue:
471
  
Inhibitor
Name:
BDBM50428890
Synonyms:
ASENAPINE | Saphris
Type:
Small organic molecule
Emp. Form.:
C17H16ClNO
Mol. Mass.:
285.768
SMILES:
CN1C[C@@H]2[C@@H](C1)c1cc(Cl)ccc1Oc1ccccc21
: