Target
Proteasome subunit beta type-2
Ligand
BDBM50430969
Substrate
Meas. Tech.
ChEMBL_946853 (CHEMBL2345964)
IC50
15±n/a nM
Citation
 Desvergne, AGenin, EMaréchal, XGallastegui, NDufau, LRichy, NGroll, MVidal, JReboud-Ravaux, M Dimerized linear mimics of a natural cyclopeptide (TMC-95A) are potent noncovalent inhibitors of the eukaryotic 20S proteasome. J Med Chem 56:3367-78 (2013)  
Target
Name:
Proteasome subunit beta type-2
Synonyms:
20S proteasome PSMB2 | Proteasome Macropain subunit
Type:
PROTEIN
Mol. Mass.:
22837.53
Organism:
Homo sapiens (Human)
Description:
ChEMBL_1294233
Residue:
201
  
Inhibitor
Name:
BDBM50430969
Synonyms:
CHEMBL2337846
Type:
Small organic molecule
Emp. Form.:
C116H150N16O20
Mol. Mass.:
2088.5274
SMILES:
C[C@H](NC(=O)[C@H](Cc1ccc(OCc2ccccc2)cc1)NC(=O)CCCCCNC(=O)CCCCCNC(=O)CCCCCNC(=O)CCCCC(=O)NCCCCCC(=O)NCCCCCC(=O)NCCCCCC(=O)N[C@@H](Cc1ccc(OCc2ccccc2)cc1)C(=O)N[C@@H](C)C(=O)N[C@@H](C[C@]1(O)C(=O)Nc2ccccc12)C(=O)NCc1ccccc1)C(=O)N[C@@H](C[C@]1(O)C(=O)Nc2ccccc12)C(=O)NCc1ccccc1
: