Target
Acid ceramidase
Ligand
BDBM50431271
Substrate
Meas. Tech.
ChEMBL_949261 (CHEMBL2346137)
IC50
12±n/a nM
Citation
 Pizzirani, DPagliuca, CRealini, NBranduardi, DBottegoni, GMor, MBertozzi, FScarpelli, RPiomelli, DBandiera, T Discovery of a new class of highly potent inhibitors of acid ceramidase: synthesis and structure-activity relationship (SAR). J Med Chem 56:3518-30 (2013)  
Target
Name:
Acid ceramidase
Synonyms:
AC ASAH1_RAT Acid ceramidase Acylsphingosine deacylase N-acylsphingosine amidohydrolase
Type:
Enzyme
Mol. Mass.:
44450.22
Organism:
Rattus norvegicus (Rat)
Description:
Q6P7S1
Residue:
394
  
Inhibitor
Name:
BDBM50431271
Synonyms:
CHEMBL2333033 | US9428465, 4
Type:
Small organic molecule
Emp. Form.:
C12H16F3N3O3
Mol. Mass.:
307.2689
SMILES:
CCCCCCNC(=O)n1cc(c(=O)[nH]c1=O)C(F)(F)F
: