Target
C-X-C chemokine receptor type 2
Ligand
BDBM50432427
Substrate
Meas. Tech.
ChEMBL_953473 (CHEMBL2351084)
Ki
4.1±n/a nM
Citation
 Karlström, SNordvall, GSohn, DHettman, ATurek, DÅhlin, KKers, AClaesson, MSlivo, CLo-Alfredsson, YPetersson, CBessidskaia, GSvensson, PHRein, TJerning, EMalmberg, ÅAhlgen, CRay, CVares, LIvanov, VJohansson, R Substituted 7-amino-5-thio-thiazolo[4,5-d]pyrimidines as potent and selective antagonists of the fractalkine receptor (CX3CR1). J Med Chem 56:3177-90 (2013)  
Target
Name:
C-X-C chemokine receptor type 2
Synonyms:
C-X-C chemokine receptor type 2 (CXCR-2) CD_antigen=CD182 CXCR-2 CXCR2_HUMAN GRO/MGSA receptor IL-8 receptor type 2 IL8RB | Interleukin-8 receptor B
Type:
Protein
Mol. Mass.:
40767.88
Organism:
Homo sapiens (Human)
Description:
P25025
Residue:
360
  
Inhibitor
Name:
BDBM50432427
Synonyms:
CHEMBL2349306
Type:
Small organic molecule
Emp. Form.:
C18H20F2N4O2S2
Mol. Mass.:
426.504
SMILES:
CC(C)C[C@H](CO)Nc1nc(SCc2cccc(F)c2F)[nH]c2nc(=O)sc12
: