Target
G-protein coupled receptor 35
Ligand
BDBM14363
Substrate
Meas. Tech.
ChEMBL_964310 (CHEMBL2395572)
EC50
980±n/a nM
Citation
 Funke, MThimm, DSchiedel, ACMüller, CE 8-Benzamidochromen-4-one-2-carboxylic acids: potent and selective agonists for the orphan G protein-coupled receptor GPR35. J Med Chem 56:5182-97 (2013)  
Target
Name:
G-protein coupled receptor 35
Synonyms:
GPR35_MOUSE KYNA receptor | Kynurenic acid receptor
Type:
PROTEIN
Mol. Mass.:
34163.11
Organism:
Mus musculus
Description:
ChEMBL_107606
Residue:
307
  
Inhibitor
Name:
BDBM14363
Synonyms:
3-(2-propoxyphenyl)-2,4,7,8,9-pentazabicyclo[4.3.0]nona-1,3,6-trien-5-one Tocris-0947 | Zaprinast
Type:
Small organic molecule
Emp. Form.:
C13H13N5O2
Mol. Mass.:
271.2746
SMILES:
CCCOc1ccccc1-c1nc2nn[nH]c2c(=O)[nH]1
: