Target
Major prion protein
Ligand
BDBM75523
Substrate
Meas. Tech.
ChEMBL_972294 (CHEMBL2411805)
EC50
512±n/a nM
Citation
 Li, ZRao, SGever, JRWidjaja, KPrusiner, SBSilber, BM Optimization of Arylamides as Novel, Potent and Brain-penetrant Antiprion Lead Compounds. ACS Med Chem Lett 4:647-650 (2013)  
Target
Name:
Major prion protein
Synonyms:
CD_antigen=CD230 PRNP SIP
Type:
PROTEIN
Mol. Mass.:
27930.26
Organism:
Ovis aries
Description:
ChEMBL_107628
Residue:
256
  
Inhibitor
Name:
BDBM75523
Synonyms:
3-Methoxy-naphthalene-2-carboxylic acid (4-ethoxy-phenyl)-amide MLS001207312 N-(4-ethoxyphenyl)-3-methoxy-naphthalene-2-carboxamide SMR000513536 | cid_790575
Type:
Small organic molecule
Emp. Form.:
C20H19NO3
Mol. Mass.:
321.3698
SMILES:
CCOc1ccc(NC(=O)c2cc3ccccc3cc2OC)cc1
: