Target
Progesterone receptor
Ligand
BDBM50318300
Substrate
Meas. Tech.
ChEMBL_974210 (CHEMBL2411344)
IC50
>20000±n/a nM
Citation
 Yang, CShen, HCWu, ZChu, HDCox, JMBalsells, JCrespo, ABrown, PZamlynny, BWiltsie, JClemas, JGibson, JContino, LLisnock, JZhou, GGarcia-Calvo, MBateman, TXu, LTong, XCrook, MSinclair, P Discovery of novel oxazolidinedione derivatives as potent and selective mineralocorticoid receptor antagonists. Bioorg Med Chem Lett 23:4388-92 (2013)  
Target
Name:
Progesterone receptor
Synonyms:
NR3C3 PGR PRGR_HUMAN | progesterone
Type:
Protein
Mol. Mass.:
98979.52
Organism:
Homo sapiens (Human)
Description:
P06401
Residue:
933
  
Inhibitor
Name:
BDBM50318300
Synonyms:
CHEMBL1095097 SC-66110
Type:
Small organic molecule
Emp. Form.:
C24H30O6
Mol. Mass.:
414.4914
SMILES:
COC(=O)[C@@H]1CC2=CC(=O)CC[C@]2(C)[C@@]23O[C@@H]2C[C@@]2(C)[C@@H](CC[C@@]22CCC(=O)O2)[C@H]13
: