Target
Cytochrome P450 11B2, mitochondrial
Ligand
BDBM25458
Substrate
Meas. Tech.
ChEMBL_979127 (CHEMBL2421742)
IC50
1750±n/a nM
Citation
 Pinto-Bazurco Mendieta, MAHu, QEngel, MHartmann, RW Highly potent and selective nonsteroidal dual inhibitors of CYP17/CYP11B2 for the treatment of prostate cancer to reduce risks of cardiovascular diseases. J Med Chem 56:6101-7 (2013)  
Target
Name:
Cytochrome P450 11B2, mitochondrial
Synonyms:
Aldosterone Synthase (CYP11B2) Aldosterone-synthesizing enzyme CYP11B2 Cytochrome P450 11B2 Cytochrome P450 11B2, mitochondrial P-450C18 | Steroid 18-hydroxylase
Type:
Protein
Mol. Mass.:
57582.15
Organism:
Homo sapiens (Human)
Description:
P19099
Residue:
503
  
Inhibitor
Name:
BDBM25458
Synonyms:
(1S,2R,5S,10R,11S,15S)-2,15-dimethyl-14-(pyridin-3-yl)tetracyclo[8.7.0.0^{2,7}.0^{11,15}]heptadeca-7,13-dien-5-ol Abiraterone CHEMBL254328 US9611270, Example 5, abiraterone
Type:
steroidal compound
Emp. Form.:
C24H31NO
Mol. Mass.:
349.509
SMILES:
[H][C@@]12CC=C(c3cccnc3)[C@@]1(C)CC[C@@]1([H])[C@@]2([H])CC=C2C[C@@H](O)CC[C@]12C
: