Target
Growth hormone secretagogue receptor type 1
Ligand
BDBM50440260
Substrate
Meas. Tech.
ChEMBL_982014 (CHEMBL2428369)
Ki
275±n/a nM
Citation
 McClure, KFJackson, MCameron, KOKung, DWPerry, DAOrr, STZhang, YKohrt, JTu, MGao, HFernando, DJones, RErasga, NWang, GPolivkova, JJiao, WSwartz, RUeno, HBhattacharya, SKStock, IAVarma, SBagdasarian, VPerez, SKelly-Sullivan, DWang, RKong, JCornelius, PMichael, LLee, EJanssen, ASteyn, SJLapham, KGoosen, T Identification of potent, selective, CNS-targeted inverse agonists of the ghrelin receptor. Bioorg Med Chem Lett 23:5410-4 (2013)  
Target
Name:
Growth hormone secretagogue receptor type 1
Synonyms:
GH-releasing peptide receptor GHS-R GHSR_HUMAN Ghrelin receptor | Ghrelin receptor 1a (GHS-R1a)
Type:
Receptor
Mol. Mass.:
41334.57
Organism:
Homo sapiens (Human)
Description:
Receptor binding studies use plasma membranes from LLC PK-1 cells transiently transfected with hGHSR1a.
Residue:
366
  
Inhibitor
Name:
BDBM50440260
Synonyms:
CHEMBL2426676
Type:
Small organic molecule
Emp. Form.:
C29H32N4O2
Mol. Mass.:
468.59
SMILES:
COc1ccc(CC(=O)N2CCC3(CN(C3)[C@H]3CCc4cc(ccc34)-c3ncccn3)CC2)cc1
: