Target
Lethal(3)malignant brain tumor-like protein 4
Ligand
BDBM50440605
Substrate
Meas. Tech.
ChEMBL_983407 (CHEMBL2429077)
IC50
>10000±n/a nM
Citation
 James, LIKorboukh, VKKrichevsky, LBaughman, BMHerold, JMNorris, JLJin, JKireev, DBJanzen, WPArrowsmith, CHFrye, SV Small-molecule ligands of methyl-lysine binding proteins: optimization of selectivity for L3MBTL3. J Med Chem 56:7358-71 (2013)  
Target
Name:
Lethal(3)malignant brain tumor-like protein 4
Synonyms:
H-l(3)mbt-like protein 4 L3MBTL4 | LMBL4_HUMAN
Type:
PROTEIN
Mol. Mass.:
71132.81
Organism:
Homo sapiens (Human)
Description:
ChEMBL_983407
Residue:
623
  
Inhibitor
Name:
BDBM50440605
Synonyms:
CHEMBL2424677
Type:
Small organic molecule
Emp. Form.:
C33H39N5O2
Mol. Mass.:
537.6951
SMILES:
CCN1Cc2ccc(NC(=O)c3ccc(C(=O)N4CCC(CC4)C4CCCN4)c(Nc4ccccc4)c3)cc2C1
: