Target
Lysine-specific demethylase 5A
Ligand
BDBM50440590
Substrate
Meas. Tech.
ChEMBL_983400 (CHEMBL2429070)
IC50
>10000±n/a nM
Citation
 James, LIKorboukh, VKKrichevsky, LBaughman, BMHerold, JMNorris, JLJin, JKireev, DBJanzen, WPArrowsmith, CHFrye, SV Small-molecule ligands of methyl-lysine binding proteins: optimization of selectivity for L3MBTL3. J Med Chem 56:7358-71 (2013)  
Target
Name:
Lysine-specific demethylase 5A
Synonyms:
Histone demethylase JARID1A Jumonji/ARID domain-containing protein 1A KDM5A_HUMAN RBBP-2 RBP2 | Retinoblastoma-binding protein 2
Type:
Protein
Mol. Mass.:
192091.79
Organism:
Homo sapiens (Human)
Description:
P29375
Residue:
1690
  
Inhibitor
Name:
BDBM50440590
Synonyms:
CHEMBL2426491
Type:
Small organic molecule
Emp. Form.:
C27H40N4O2
Mol. Mass.:
452.6321
SMILES:
O=C(N1CCC(CC1)C1CCNCC1)c1ccc(cc1)C(=O)N1CCC(CC1)N1CCCC1
: