Target
TP53-binding protein 1
Ligand
BDBM50440587
Substrate
Meas. Tech.
ChEMBL_983402 (CHEMBL2429072)
IC50
>10000±n/a nM
Citation
 James, LIKorboukh, VKKrichevsky, LBaughman, BMHerold, JMNorris, JLJin, JKireev, DBJanzen, WPArrowsmith, CHFrye, SV Small-molecule ligands of methyl-lysine binding proteins: optimization of selectivity for L3MBTL3. J Med Chem 56:7358-71 (2013)  
Target
Name:
TP53-binding protein 1
Synonyms:
53BP1 TP53BP1 Tumor suppressor p53-binding protein 1 p53BP1
Type:
PROTEIN
Mol. Mass.:
213442.98
Organism:
Homo sapiens (Human)
Description:
ChEMBL_107658
Residue:
1972
  
Inhibitor
Name:
BDBM50440587
Synonyms:
CHEMBL2426494
Type:
Small organic molecule
Emp. Form.:
C29H45N5O2
Mol. Mass.:
495.6999
SMILES:
CC(C1CCN(CC1)C(=O)c1ccc(cc1)C(=O)N1CCC(CC1)N1CCCC1)N1CCN(C)CC1
: