Target
Chromobox protein homolog 7
Ligand
BDBM50440609
Substrate
Meas. Tech.
ChEMBL_983405 (CHEMBL2429075)
IC50
>10000±n/a nM
Citation
 James, LIKorboukh, VKKrichevsky, LBaughman, BMHerold, JMNorris, JLJin, JKireev, DBJanzen, WPArrowsmith, CHFrye, SV Small-molecule ligands of methyl-lysine binding proteins: optimization of selectivity for L3MBTL3. J Med Chem 56:7358-71 (2013)  
Target
Name:
Chromobox protein homolog 7
Synonyms:
CBX7 Chromobox protein homolog 7 | Chromobox protein homolog 7 (CBX7)
Type:
Protein
Mol. Mass.:
28351.76
Organism:
Homo sapiens (Human)
Description:
Residue:
251
  
Inhibitor
Name:
BDBM50440609
Synonyms:
CHEMBL2426373
Type:
Small organic molecule
Emp. Form.:
C27H34N4O2
Mol. Mass.:
446.5845
SMILES:
CCN1Cc2ccc(NC(=O)c3ccc(cc3)C(=O)N3CCC(CC3)N3CCCC3)cc2C1
: