Target
Chromobox protein homolog 7
Ligand
BDBM50440598
Substrate
Meas. Tech.
ChEMBL_983405 (CHEMBL2429075)
IC50
>10000±n/a nM
Citation
 James, LIKorboukh, VKKrichevsky, LBaughman, BMHerold, JMNorris, JLJin, JKireev, DBJanzen, WPArrowsmith, CHFrye, SV Small-molecule ligands of methyl-lysine binding proteins: optimization of selectivity for L3MBTL3. J Med Chem 56:7358-71 (2013)  
Target
Name:
Chromobox protein homolog 7
Synonyms:
CBX7 Chromobox protein homolog 7 | Chromobox protein homolog 7 (CBX7)
Type:
Protein
Mol. Mass.:
28351.76
Organism:
Homo sapiens (Human)
Description:
Residue:
251
  
Inhibitor
Name:
BDBM50440598
Synonyms:
CHEMBL2426483
Type:
Small organic molecule
Emp. Form.:
C26H40N4O
Mol. Mass.:
424.622
SMILES:
O=C(N1CCC(CC1)N1CCCC1)c1ccc(CN2CCC(CC2)N2CCCC2)cc1
: