Target
3-oxoacyl-[acyl-carrier-protein] reductase
Ligand
BDBM50440619
Substrate
Meas. Tech.
ChEMBL_983602 (CHEMBL2427114)
IC50
>100000±n/a nM
Citation
 Belluti, FPerozzo, RLauciello, LColizzi, FKostrewa, DBisi, AGobbi, SRampa, ABolognesi, MLRecanatini, MBrun, RScapozza, LCavalli, A Design, synthesis, and biological and crystallographic evaluation of novel inhibitors of Plasmodium falciparum enoyl-ACP-reductase (PfFabI). J Med Chem 56:7516-26 (2013)  
Target
Name:
3-oxoacyl-[acyl-carrier-protein] reductase
Synonyms:
3-oxoacyl-(Acyl-carrier protein) reductase | FabG
Type:
PROTEIN
Mol. Mass.:
33360.55
Organism:
Plasmodium falciparum (isolate 3D7)
Description:
ChEMBL_107660
Residue:
301
  
Inhibitor
Name:
BDBM50440619
Synonyms:
CHEMBL2426555
Type:
Small organic molecule
Emp. Form.:
C16H11ClO5
Mol. Mass.:
318.709
SMILES:
Cc1c(Oc2ccc(Cl)cc2O)c(=O)oc2cc(O)ccc12
: