Target
Solute carrier organic anion transporter family member 1B1
Ligand
BDBM50442874
Substrate
Meas. Tech.
ChEMBL_1265864 (CHEMBL3039490)
Ki
1920±n/a nM
Citation
 De Bruyn, Tvan Westen, GJIjzerman, APStieger, Bde Witte, PAugustijns, PFAnnaert, PP Structure-based identification of OATP1B1/3 inhibitors. Mol Pharmacol 83:1257-67 (2013)  
Target
Name:
Solute carrier organic anion transporter family member 1B1
Synonyms:
LST1 OATP2 SLC21A6 SO1B1_HUMAN Solute carrier organic anion transporter family member 1B1 (OATP1B1) | Thromboxane B2
Type:
Protein
Mol. Mass.:
76468.06
Organism:
Homo sapiens (Human)
Description:
Q9Y6L6
Residue:
691
  
Inhibitor
Name:
BDBM50442874
Synonyms:
Conceptrol Emko Intercept Nonoxinol 9 Nonylphenoxypolyethoxyethanol Today | Today Sponge
Type:
Small organic molecule
Emp. Form.:
C33H60O10
Mol. Mass.:
616.8235
SMILES:
CCCCCCCCCc1ccc(OCCOCCOCCOCCOCCOCCOCCOCCOCCO)cc1
: