Target
5-hydroxytryptamine receptor 3A
Ligand
BDBM50443668
Substrate
Meas. Tech.
ChEMBL_1278461 (CHEMBL3094568)
EC50
320±n/a nM
Citation
 Del Cadia, MDe Rienzo, FWeston, DAThompson, AJMenziani, MCLummis, SC Exploring a potential palonosetron allosteric binding site in the 5-HT(3) receptor. Bioorg Med Chem 21:7523-8 (2013)  
Target
Name:
5-hydroxytryptamine receptor 3A
Synonyms:
5-HT-3 5-HT3A 5-hydroxytryptamine receptor 3 (5-HT3) 5-hydroxytryptamine receptor 3A (5HT3A) 5HT3R HTR3A Serotonin 3 receptor (5HT3) Serotonin-gated ion channel receptor | Serotonin-gated ion channel receptor 3
Type:
Protein
Mol. Mass.:
55283.27
Organism:
Homo sapiens (Human)
Description:
P46098
Residue:
478
  
Inhibitor
Name:
BDBM50443668
Synonyms:
CHEBI:5537 GRANISETRON
Type:
Small organic molecule
Emp. Form.:
C18H24N4O
Mol. Mass.:
312.4094
SMILES:
CN1[C@H]2CCC[C@@H]1C[C@@H](C2)NC(=O)c1nn(C)c2ccccc12
: