Target
2-C-methyl-D-erythritol 2,4-cyclodiphosphate synthase
Ligand
BDBM50443774
Substrate
Meas. Tech.
ChEMBL_1280332 (CHEMBL3095347)
Kd
90000±n/a nM
Citation
 Zhang, ZJakkaraju, SBlain, JGogol, KZhao, LHartley, RCKarlsson, CAStaker, BLEdwards, TEStewart, LJMyler, PJClare, MBegley, DWHorn, JRHagen, TJ Cytidine derivatives as IspF inhibitors of Burkolderia pseudomallei. Bioorg Med Chem Lett 23:6860-3 (2013)  
Target
Name:
2-C-methyl-D-erythritol 2,4-cyclodiphosphate synthase
Synonyms:
ISPF_BURPS MECPP-synthase ispF | mecS
Type:
PROTEIN
Mol. Mass.:
17174.90
Organism:
Burkholderia pseudomallei (strain K96243)
Description:
ChEMBL_107981
Residue:
162
  
Inhibitor
Name:
BDBM50443774
Synonyms:
CHEMBL3094106
Type:
Small organic molecule
Emp. Form.:
C16H17N7O5
Mol. Mass.:
387.3501
SMILES:
Nc1ccn([C@@H]2O[C@H](CNC(=O)c3ccnc4nc[nH]c34)[C@@H](O)[C@H]2O)c(=O)n1
: