Target
DNA ligase
Ligand
BDBM50444581
Substrate
Meas. Tech.
ChEMBL_1281919 (CHEMBL3101193)
IC50
220±n/a nM
Citation
 Howard, SAmin, NBenowitz, ABChiarparin, ECui, HDeng, XHeightman, TDHolmes, DJHopkins, AHuang, JJin, QKreatsoulas, CMartin, ACMassey, FMcCloskey, LMortenson, PNPathuri, PTisi, DWilliams, PA Fragment-based discovery of 6-azaindazoles as inhibitors of bacterial DNA ligase. ACS Med Chem Lett 4:1208-12 (2013)  
Target
Name:
DNA ligase
Synonyms:
DNLJ_STAAU lig | ligA
Type:
PROTEIN
Mol. Mass.:
75059.93
Organism:
Staphylococcus aureus
Description:
ChEMBL_1281598
Residue:
667
  
Inhibitor
Name:
BDBM50444581
Synonyms:
CHEMBL3099713
Type:
Small organic molecule
Emp. Form.:
C12H7F3N4
Mol. Mass.:
264.206
SMILES:
FC(F)(F)c1cccc(n1)-c1n[nH]c2cnccc12
: