Target
ATP-dependent 6-phosphofructokinase
Ligand
BDBM50446088
Substrate
Meas. Tech.
ChEMBL_1288117 (CHEMBL3110577)
Ki
52±n/a nM
Citation
 Brimacombe, KRWalsh, MJLiu, LVásquez-Valdivieso, MGMorgan, HPMcNae, IFothergill-Gilmore, LAMichels, PAAuld, DSSimeonov, AWalkinshaw, MDShen, MBoxer, MB Identification of ML251, a Potent Inhibitor of T. brucei and T. cruzi Phosphofructokinase. ACS Med Chem Lett 5:12-7 (2014)  
Target
Name:
ATP-dependent 6-phosphofructokinase
Synonyms:
6-phospho-1-fructokinase pfk
Type:
PROTEIN
Mol. Mass.:
53537.94
Organism:
Trypanosoma brucei
Description:
ChEMBL_1288121
Residue:
487
  
Inhibitor
Name:
BDBM50446088
Synonyms:
CHEMBL3108870
Type:
Small organic molecule
Emp. Form.:
C16H12ClFN4O3S2
Mol. Mass.:
426.873
SMILES:
Fc1ccc(CC(=O)Nc2ccc(cc2)S(=O)(=O)Nc2nncs2)cc1Cl
: