Target
Cytochrome P450 2C19
Ligand
BDBM50446472
Substrate
Meas. Tech.
ChEMBL_1287804 (CHEMBL3111799)
IC50
60±n/a nM
Citation
 Bürli, RWLuckhurst, CAAziz, OMatthews, KLYates, DLyons, KABeconi, MMcAllister, GBreccia, PStott, AJPenrose, SDWall, MLamers, MLeonard, PMüller, IRichardson, CMJarvis, RStones, LHughes, SWishart, GHaughan, AFO'Connell, CMead, TMcNeil, HVann, JMangette, JMaillard, MBeaumont, VMunoz-Sanjuan, IDominguez, C Design, synthesis, and biological evaluation of potent and selective class IIa histone deacetylase (HDAC) inhibitors as a potential therapy for Huntington's disease. J Med Chem 56:9934-54 (2013)  
Target
Name:
Cytochrome P450 2C19
Synonyms:
(R)-limonene 6-monooxygenase (S)-limonene 7-monooxygenase CYP2C19 CYPIIC19 Cytochrome P450 2C19 [I331V] Cytochrome P450-254C Mephenytoin 4-hydroxylase P450-254C
Type:
Enzyme
Mol. Mass.:
55935.47
Organism:
Homo sapiens (Human)
Description:
P33261
Residue:
490
  
Inhibitor
Name:
BDBM50446472
Synonyms:
CHEMBL3110021 | US9765054, Compound 41B
Type:
Small organic molecule
Emp. Form.:
C19H16N2O3
Mol. Mass.:
320.3419
SMILES:
ONC(=O)[C@@H]1[C@@H]([C@H]1c1ccc(cc1)-c1cnco1)c1ccccc1
: