Target
Alkaline phosphatase, placental type
Ligand
BDBM50447445
Substrate
Meas. Tech.
ChEMBL_1288274 (CHEMBL3117348)
IC50
>100000±n/a nM
Citation
 Ardecky, RJBobkova, EVKiffer-Moreira, TBrown, BGanji, SZou, JPass, INarisawa, SIano, FGRosenstein, CCheltsov, ARascon, JHedrick, MGasior, CForster, AShi, SDahl, RVasile, SSu, YSergienko, EChung, TDKaunitz, JHoylaerts, MFPinkerton, ABMillán, JL Identification of a selective inhibitor of murine intestinal alkaline phosphatase (ML260) by concurrent ultra-high throughput screening against human and mouse isozymes. Bioorg Med Chem Lett 24:1000-4 (2014)  
Target
Name:
Alkaline phosphatase, placental type
Synonyms:
ALPP PLAP | PPB1_HUMAN
Type:
PROTEIN
Mol. Mass.:
57950.65
Organism:
Homo sapiens (Human)
Description:
ChEMBL_1506090
Residue:
535
  
Inhibitor
Name:
BDBM50447445
Synonyms:
CHEMBL3115124
Type:
Small organic molecule
Emp. Form.:
C17H15N3O7S
Mol. Mass.:
405.382
SMILES:
O=C(CCNS(=O)(=O)c1ccc2[nH]c(=O)oc2c1)Nc1ccc2OCOc2c1
: