Target
Inhibitor of nuclear factor kappa-B kinase subunit beta
Ligand
BDBM50447837
Substrate
Meas. Tech.
ChEMBL_1290855 (CHEMBL3118440)
IC50
4780±n/a nM
Citation
 García-Rodríguez, JPérez-Rodríguez, SOrtiz, MAPereira, Rde Lera, ARPiedrafita, FJ Inhibition of I¿B kinase-ß and I¿B kinase-a by heterocyclic adamantyl arotinoids. Bioorg Med Chem 22:1285-302 (2014)  
Target
Name:
Inhibitor of nuclear factor kappa-B kinase subunit beta
Synonyms:
I-kappa-B Kinase 2 (IKK-beta) I-kappa-B-kinase beta IKBKB IKK-beta IKK2/IKK1 IKKB_HUMAN Inhibitor of nuclear factor kappa B kinase beta subunit Nuclear factor NF-kappa-B inhibitor kinase beta
Type:
Serine/threonine-protein kinase
Mol. Mass.:
86554.39
Organism:
Homo sapiens (Human)
Description:
GST-tagged IKK-2 was expressed in High Five cells and purified.
Residue:
756
  
Inhibitor
Name:
BDBM50447837
Synonyms:
CHEMBL3114297
Type:
Small organic molecule
Emp. Form.:
C27H27NO3S
Mol. Mass.:
445.573
SMILES:
Cc1cc(O)c(cc1-c1ncc(s1)-c1ccc(cc1)C(O)=O)C12CC3CC(CC(C3)C1)C2
: