Target
Aldehyde dehydrogenase, dimeric NADP-preferring
Ligand
BDBM50133625
Substrate
Meas. Tech.
ChEMBL_1295316 (CHEMBL3130564)
IC50
16000±n/a nM
Citation
 Kimble-Hill, ACParajuli, BChen, CHMochly-Rosen, DHurley, TD Development of selective inhibitors for aldehyde dehydrogenases based on substituted indole-2,3-diones. J Med Chem 57:714-22 (2014)  
Target
Name:
Aldehyde dehydrogenase, dimeric NADP-preferring
Synonyms:
AL3A1_HUMAN ALDH3A1 Aldehyde dehydrogenase family 3 member A1 (ALDH3A1) | Aldehyde dehydrogenase family 3 member A1 (ALDH3A1) (Q122A)
Type:
Protein
Mol. Mass.:
50394.38
Organism:
Homo sapiens (Human)
Description:
Residue:
453
  
Inhibitor
Name:
BDBM50133625
Synonyms:
1-Benzyl-5-chloro-1H-indole-2,3-dione | CHEMBL336693
Type:
Small organic molecule
Emp. Form.:
C15H10ClNO2
Mol. Mass.:
271.698
SMILES:
Clc1ccc2N(Cc3ccccc3)C(=O)C(=O)c2c1
: