Target
Acetylcholinesterase
Ligand
BDBM50005191
Substrate
Meas. Tech.
ChEMBL_1281569 (CHEMBL3102254)
Ki
1.9±n/a nM
Citation
 Butini, SBrindisi, MBrogi, SMaramai, SGuarino, EPanico, ASaxena, AChauhan, VColombo, RVerga, LDe Lorenzi, EBartolini, MAndrisano, VNovellino, ECampiani, GGemma, S Multifunctional cholinesterase and amyloid Beta fibrillization modulators. Synthesis and biological investigation. ACS Med Chem Lett 4:1178-82 (2013)  
Target
Name:
Acetylcholinesterase
Synonyms:
ACES_HUMAN Acetylcholinesterase (AChE) | Acetylcholinesterase (human AChE)
Type:
Enzyme
Mol. Mass.:
67792.70
Organism:
Homo sapiens (Human)
Description:
P22303
Residue:
614
  
Inhibitor
Name:
BDBM50005191
Synonyms:
CHEMBL3099498
Type:
Small organic molecule
Emp. Form.:
C67H77N9O8
Mol. Mass.:
1136.3838
SMILES:
O=C(CC[C@H](NC(=O)CNC(=O)OCc1ccccc1)C(=O)N[C@@H](Cc1ccccc1)C(=O)OCc1ccccc1)NCC(=O)Nc1cccc2c(NCCCCCCCCNc3c4CCCCc4nc4ccccc34)c3CCCCc3nc12
: