Target
Dipeptidyl peptidase 4
Ligand
BDBM50003020
Substrate
Meas. Tech.
ChEMBL_1339813 (CHEMBL3243518)
IC50
1.6±n/a nM
Citation
 Biftu, TSinha-Roy, RChen, PQian, XFeng, DKuethe, JTScapin, GGao, YDYan, YKrueger, DBak, AEiermann, GHe, JCox, JHicks, JLyons, KHe, HSalituro, GTong, SPatel, SDoss, GPetrov, AWu, JXu, SSSewall, CZhang, XZhang, BThornberry, NAWeber, AE Omarigliptin (MK-3102): a novel long-acting DPP-4 inhibitor for once-weekly treatment of type 2 diabetes. J Med Chem 57:3205-12 (2014)  
Target
Name:
Dipeptidyl peptidase 4
Synonyms:
ADABP Adenosine deaminase complexing protein 2 CD_antigen=CD26 DPP4 DPPIV Dipeptidyl peptidase 4 (DPP IV) Dipeptidyl peptidase 4 (DPP4) Dipeptidyl peptidase 4 membrane form Dipeptidyl peptidase IV Dipeptidyl peptidase IV (DDP-IV) Dipeptidyl peptidase IV membrane form Dipeptidyl peptidase-IV (DPP-4) T-cell activation antigen CD26 | TP103
Type:
Enzyme
Mol. Mass.:
88271.01
Organism:
Homo sapiens (Human)
Description:
P27487
Residue:
766
  
Inhibitor
Name:
BDBM50003020
Synonyms:
MK-3102 US10155775, Omarigliptin US10822319, Compound Omarigliptin
Type:
Small organic molecule
Emp. Form.:
C17H20F2N4O3S
Mol. Mass.:
398.428
SMILES:
CS(=O)(=O)n1cc2CN(Cc2n1)[C@H]1CO[C@@H]([C@@H](N)C1)c1cc(F)ccc1F
: