Target
Advanced glycosylation end product-specific receptor
Ligand
BDBM50005633
Substrate
Meas. Tech.
ChEMBL_1339876 (CHEMBL3243665)
IC50
1900±n/a nM
Citation
 Han, YTKim, KChoi, GIAn, HSon, DKim, HHa, HJSon, JHChung, SJPark, HJLee, JSuh, YG Pyrazole-5-carboxamides, novel inhibitors of receptor for advanced glycation end products (RAGE). Eur J Med Chem 79:128-42 (2014)  
Target
Name:
Advanced glycosylation end product-specific receptor
Synonyms:
AGER RAGE_HUMAN | Receptor for advanced glycosylation end products
Type:
PROTEIN
Mol. Mass.:
42800.11
Organism:
Homo sapiens (Human)
Description:
ChEMBL_1339877
Residue:
404
  
Inhibitor
Name:
BDBM50005633
Synonyms:
CHEMBL3235374
Type:
Small organic molecule
Emp. Form.:
C35H41F3N4O4
Mol. Mass.:
638.7196
SMILES:
CCCCOc1cc(OCCCN(CC)CC)ccc1NC(=O)c1cc(nn1C)-c1ccc(Oc2ccc(cc2)C(F)(F)F)cc1
: