Target
Ubiquitin carboxyl-terminal hydrolase 8
Ligand
BDBM50007789
Substrate
Meas. Tech.
ChEMBL_1335826 (CHEMBL3239935)
IC50
>100000±n/a nM
Citation
 Báez-Santos, YMBarraza, SJWilson, MWAgius, MPMielech, AMDavis, NMBaker, SCLarsen, SDMesecar, AD X-ray structural and biological evaluation of a series of potent and highly selective inhibitors of human coronavirus papain-like proteases. J Med Chem 57:2393-412 (2014)  
Target
Name:
Ubiquitin carboxyl-terminal hydrolase 8
Synonyms:
Deubiquitinating enzyme 8 UBP8_HUMAN USP8 Ubiquitin thioesterase 8 hUBPy
Type:
PROTEIN
Mol. Mass.:
127547.92
Organism:
Homo sapiens (Human)
Description:
ChEMBL_105200
Residue:
1118
  
Inhibitor
Name:
BDBM50007789
Synonyms:
CHEMBL1173044 N-(2H-1,3-benzodioxol-5-ylmethyl)-1-[(1R)-1-(naphthalen-1-yl)ethyl]piperidine-4-carboxamide (I-3) | med.21724, Compound 165
Type:
Small organic molecule
Emp. Form.:
C26H28N2O3
Mol. Mass.:
416.5121
SMILES:
C[C@@H](N1CCC(CC1)C(=O)NCc1ccc2OCOc2c1)c1cccc2ccccc12
: