Target
Acrosin
Ligand
BDBM50010084
Substrate
Meas. Tech.
ChEMBL_1344334 (CHEMBL3257004)
Ki
1600±n/a nM
Citation
 Parrish, RFStraus, JWPaulson, JDPolakoski, KLTidwell, RRGeratz, JDStevens, FM Structure-activity relationships for the inhibition of acrosin by benzamidine derivatives. J Med Chem 21:1132-6 (1979)  
Target
Name:
Acrosin
Synonyms:
53 kDa fucose-binding protein ACRO_PIG Acrosin light chain
Type:
PROTEIN
Mol. Mass.:
45383.66
Organism:
Sus scrofa
Description:
ChEMBL_108297
Residue:
415
  
Inhibitor
Name:
BDBM50010084
Synonyms:
CHEMBL2418047
Type:
Small organic molecule
Emp. Form.:
C15H16N2O2
Mol. Mass.:
256.2997
SMILES:
COc1ccc(OCc2ccc(cc2)C(N)=N)cc1
: