Target
Adenosine receptor A2a
Ligand
BDBM50254013
Substrate
Meas. Tech.
ChEMBL_1352083 (CHEMBL3267348)
Ki
1.3±n/a nM
Citation
 de Lera Ruiz, MLim, YHZheng, J Adenosine A2A receptor as a drug discovery target. J Med Chem 57:3623-50 (2014)  
Target
Name:
Adenosine receptor A2a
Synonyms:
A2A adenosine receptor (hA2A) ADENOSINE A2 ADORA2 Adenosine A2A receptor (A2AAR)
Type:
G Protein-Coupled Receptor (GPCR)
Mol. Mass.:
44716.46
Organism:
Homo sapiens (Human)
Description:
P29274
Residue:
412
  
Inhibitor
Name:
BDBM50254013
Synonyms:
3-(4-Amino-3-methylbenzyl)-7-(2-furyl)-3H-[1,2,3]triazolo[4,5-d]pyrimidine-5-amine | CHEMBL447664
Type:
Small organic molecule
Emp. Form.:
C16H15N7O
Mol. Mass.:
321.3366
SMILES:
Cc1cc(Cn2nnc3c(nc(N)nc23)-c2ccco2)ccc1N
: