Target
Adenosine receptor A1
Ligand
BDBM50011294
Substrate
Meas. Tech.
ChEMBL_1352084 (CHEMBL3267349)
Ki
1350±n/a nM
Citation
 de Lera Ruiz, MLim, YHZheng, J Adenosine A2A receptor as a drug discovery target. J Med Chem 57:3623-50 (2014)  
Target
Name:
Adenosine receptor A1
Synonyms:
A1 adenosine receptor (hA1) AA1R_HUMAN ADORA1 Adenosine A1-receptor Adenosine receptor A1 (hA1) | Adenosine transporter (AdT)
Type:
G Protein-Coupled Receptor (GPCR)
Mol. Mass.:
36520.92
Organism:
Homo sapiens (Human)
Description:
P30542
Residue:
326
  
Inhibitor
Name:
BDBM50011294
Synonyms:
A2A Ro-4494351-002 SYN-115 | TOZADENANT
Type:
Small organic molecule
Emp. Form.:
C19H26N4O4S
Mol. Mass.:
406.499
SMILES:
COc1ccc(N2CCOCC2)c2sc(NC(=O)N3CCC(C)(O)CC3)nc12
: