Target
Cytochrome P450 11B2, mitochondrial
Ligand
BDBM50444549
Substrate
Meas. Tech.
ChEMBL_1361870 (CHEMBL3293045)
IC50
0.200000±n/a nM
Citation
 Yin, LHu, QEmmerich, JLo, MMMetzger, EAli, AHartmann, RW Novel pyridyl- or isoquinolinyl-substituted indolines and indoles as potent and selective aldosterone synthase inhibitors. J Med Chem 57:5179-89 (2014)  
Target
Name:
Cytochrome P450 11B2, mitochondrial
Synonyms:
Aldosterone Synthase (CYP11B2) Aldosterone-synthesizing enzyme CYP11B2 Cytochrome P450 11B2 Cytochrome P450 11B2, mitochondrial P-450C18 | Steroid 18-hydroxylase
Type:
Protein
Mol. Mass.:
57582.15
Organism:
Homo sapiens (Human)
Description:
P19099
Residue:
503
  
Inhibitor
Name:
BDBM50444549
Synonyms:
CHEMBL3099695
Type:
Small organic molecule
Emp. Form.:
C13H10FN3
Mol. Mass.:
227.237
SMILES:
Fc1cc(ccc1[C@H]1CCc2cncn12)C#N
: