Target
Dihydroorotate dehydrogenase (quinone), mitochondrial
Ligand
BDBM50020688
Substrate
Meas. Tech.
ChEMBL_1362299 (CHEMBL3291895)
IC50
1090±n/a nM
Citation
 Vyas, VKVariya, BGhate, MD Design, synthesis and pharmacological evaluation of novel substituted quinoline-2-carboxamide derivatives as human dihydroorotate dehydrogenase (hDHODH) inhibitors and anticancer agents. Eur J Med Chem 82:385-93 (2014)  
Target
Name:
Dihydroorotate dehydrogenase (quinone), mitochondrial
Synonyms:
DHODH Dihydroorotate dehydrogenase Dihydroorotate dehydrogenase, mitochondrial Dihydroorotate oxidase (DHODH) | PYRD_HUMAN
Type:
Enzyme
Mol. Mass.:
42881.33
Organism:
Homo sapiens (Human)
Description:
Q02127
Residue:
395
  
Inhibitor
Name:
BDBM50020688
Synonyms:
CHEMBL3290847
Type:
Small organic molecule
Emp. Form.:
C25H20N2O4
Mol. Mass.:
412.4373
SMILES:
COc1ccc2nc(C(=O)Nc3ccc(cc3)-c3ccccc3)c(C)c(C(O)=O)c2c1
: