Target
Integrin alpha-L
Ligand
BDBM50021689
Substrate
Meas. Tech.
ChEMBL_1368331 (CHEMBL864781)
IC50
37±n/a nM
Citation
 Kollmann, CSBai, XTsai, CHYang, HLind, KESkinner, SRZhu, ZIsrael, DICuozzo, JWMorgan, BAYuki, KXie, CSpringer, TAShimaoka, MEvindar, G Application of encoded library technology (ELT) to a protein-protein interaction target: discovery of a potent class of integrin lymphocyte function-associated antigen 1 (LFA-1) antagonists. Bioorg Med Chem 22:2353-65 (2014)  
Target
Name:
Integrin alpha-L
Synonyms:
CD11 antigen-like family member A CD_antigen=CD11a ITGAL LFA-1A Leukocyte adhesion glycoprotein LFA-1 alpha chain | Leukocyte function-associated molecule 1 alpha chain
Type:
PROTEIN
Mol. Mass.:
128748.90
Organism:
Homo sapiens (Human)
Description:
ChEMBL_629045
Residue:
1170
  
Inhibitor
Name:
BDBM50021689
Synonyms:
CHEMBL3298411
Type:
Small organic molecule
Emp. Form.:
C34H30Cl2F3N7O3
Mol. Mass.:
712.548
SMILES:
OC(=O)C1(Cc2ccccc2C1)Nc1nc(NCCc2ccc(Cl)c(Cl)c2)nc(n1)N1CC2CC1CN2C(=O)c1cccc(c1)C(F)(F)F
: