Target
Farnesyl pyrophosphate synthase
Ligand
BDBM12576
Substrate
Meas. Tech.
ChEMBL_1368841
IC50
200±n/a nM
Citation
 De Schutter, JWPark, JLeung, CYGormley, PLin, YSHu, ZBerghuis, AMPoirier, JTsantrizos, YS Multistage screening reveals chameleon ligands of the human farnesyl pyrophosphate synthase: implications to drug discovery for neurodegenerative diseases. J Med Chem 57:5764-76 (2014)  
Target
Name:
Farnesyl pyrophosphate synthase
Synonyms:
Dimethylallyltranstransferase FPP synthase FPPS_HUMAN Farnesyl diphosphate synthase Farnesyl diphosphate synthetase Farnesyl pyrophosphate synthetase KIAA1293 | P14324
Type:
Enzyme
Mol. Mass.:
48272.89
Organism:
Homo sapiens (Human)
Description:
P14324
Residue:
419
  
Inhibitor
Name:
BDBM12576
Synonyms:
Bisphosphonate 1 JMC515594 Compound 64 Risdronate [1-hydroxy-1-phosphono-2-(pyridin-3-yl)ethyl]phosphonic acid
Type:
Small organic molecule
Emp. Form.:
C7H11NO7P2
Mol. Mass.:
283.1123
SMILES:
OC(Cc1cccnc1)(P(O)(O)=O)P(O)(O)=O
: