Target
Progesterone receptor
Ligand
BDBM50318300
Substrate
Meas. Tech.
ChEMBL_1438889 (CHEMBL3381814)
IC50
>10000±n/a nM
Citation
 Hasui, TOhyabu, NOhra, TFuji, KSugimoto, TFujimoto, JAsano, KOosawa, MShiotani, SNishigaki, NKusumoto, KMatsui, HMizukami, AHabuka, NSogabe, SEndo, SOno, MSiedem, CSTang, TPGauthier, CDe Meese, LABoyd, SAFukumoto, S Discovery of 6-[5-(4-fluorophenyl)-3-methyl-pyrazol-4-yl]-benzoxazin-3-one derivatives as novel selective nonsteroidal mineralocorticoid receptor antagonists. Bioorg Med Chem 22:5428-45 (2014)  
Target
Name:
Progesterone receptor
Synonyms:
NR3C3 PGR PRGR_HUMAN | progesterone
Type:
Protein
Mol. Mass.:
98979.52
Organism:
Homo sapiens (Human)
Description:
P06401
Residue:
933
  
Inhibitor
Name:
BDBM50318300
Synonyms:
CHEMBL1095097 SC-66110
Type:
Small organic molecule
Emp. Form.:
C24H30O6
Mol. Mass.:
414.4914
SMILES:
COC(=O)[C@@H]1CC2=CC(=O)CC[C@]2(C)[C@@]23O[C@@H]2C[C@@]2(C)[C@@H](CC[C@@]22CCC(=O)O2)[C@H]13
: