Target
Aminopeptidase N
Ligand
BDBM50078125
Substrate
Meas. Tech.
ChEMBL_1442055 (CHEMBL3373423)
Ki
1.2±n/a nM
Citation
 Vassiliou, SWeglarz-Tomczak, EBerlicki, LPawelczak, MNocek, BMulligan, RJoachimiak, AMucha, A Structure-guided, single-point modifications in the phosphinic dipeptide structure yield highly potent and selective inhibitors of neutral aminopeptidases. J Med Chem 57:8140-51 (2014)  
Target
Name:
Aminopeptidase N
Synonyms:
AMPN_PIG AP-M Alanyl aminopeptidase Aminopeptidase N (APN) Microsomal aminopeptidase pAPN
Type:
Protein
Mol. Mass.:
108810.25
Organism:
Sus scrofa (Pig)
Description:
P15145
Residue:
963
  
Inhibitor
Name:
BDBM50078125
Synonyms:
(1-Amino-3-phenyl-propyl)-phosphinic acid | CHEMBL289824
Type:
Small organic molecule
Emp. Form.:
C9H12NO2P
Mol. Mass.:
197.1708
SMILES:
OP(O)C(=N)CCc1ccccc1
: