Target
Cytosol aminopeptidase [33-68,L62W]
Ligand
BDBM50078125
Substrate
Meas. Tech.
ChEMBL_1442056 (CHEMBL3373424)
Ki
7.7±n/a nM
Citation
 Vassiliou, SWeglarz-Tomczak, EBerlicki, LPawelczak, MNocek, BMulligan, RJoachimiak, AMucha, A Structure-guided, single-point modifications in the phosphinic dipeptide structure yield highly potent and selective inhibitors of neutral aminopeptidases. J Med Chem 57:8140-51 (2014)  
Target
Name:
Cytosol aminopeptidase [33-68,L62W]
Synonyms:
AMPL_PIG LAP3 | Leucine aminopeptidase (LAP)
Type:
Enzyme
Mol. Mass.:
4015.44
Organism:
Sus scrofa (Pig)
Description:
P28839[33-68,L62W]
Residue:
36
  
Inhibitor
Name:
BDBM50078125
Synonyms:
(1-Amino-3-phenyl-propyl)-phosphinic acid | CHEMBL289824
Type:
Small organic molecule
Emp. Form.:
C9H12NO2P
Mol. Mass.:
197.1708
SMILES:
OP(O)C(=N)CCc1ccccc1
: