Target
5-hydroxytryptamine receptor 2A
Ligand
BDBM50241050
Substrate
Meas. Tech.
ChEMBL_1442874 (CHEMBL3377152)
EC50
4.6±n/a nM
Citation
 Blough, BELandavazo, APartilla, JSDecker, AMPage, KMBaumann, MHRothman, RB Alpha-ethyltryptamines as dual dopamine-serotonin releasers. Bioorg Med Chem Lett 24:4754-8 (2014)  
Target
Name:
5-hydroxytryptamine receptor 2A
Synonyms:
5-HT-2 5-HT2A 5-hydroxytryptamine receptor 2A (5HT-2A) 5HT2A_HUMAN HTR2A | Serotonin receptor 2A
Type:
undefined
Mol. Mass.:
52607.65
Organism:
Homo sapiens (Human)
Description:
P28223
Residue:
471
  
Inhibitor
Name:
BDBM50241050
Synonyms:
2-(6-fluoro-1H-indol-3-yl)ethanamine CHEMBL381160
Type:
Small organic molecule
Emp. Form.:
C10H11FN2
Mol. Mass.:
178.2061
SMILES:
NCCc1c[nH]c2cc(F)ccc12
: