Target
1-deoxy-D-xylulose-5-phosphate synthase
Ligand
BDBM50026350
Substrate
Meas. Tech.
ChEMBL_1441269 (CHEMBL3380659)
IC50
1000±n/a nM
Citation
 Masini, THirsch, AK Development of inhibitors of the 2C-methyl-D-erythritol 4-phosphate (MEP) pathway enzymes as potential anti-infective agents. J Med Chem 57:9740-63 (2014)  
Target
Name:
1-deoxy-D-xylulose-5-phosphate synthase
Synonyms:
1-deoxy-D-xylulose-5-phosphate synthase DXP synthase DXS_HAEI8 | dxs
Type:
PROTEIN
Mol. Mass.:
68590.64
Organism:
Haemophilus influenzae (strain 86-028NP)
Description:
ChEMBL_109723
Residue:
625
  
Inhibitor
Name:
BDBM50026350
Synonyms:
CHEMBL3359031
Type:
Small organic molecule
Emp. Form.:
C12H14ClNO4
Mol. Mass.:
271.697
SMILES:
CC(C)(C(O)=O)C(=O)N(O)Cc1ccccc1Cl
: