Target
1-deoxy-D-xylulose 5-phosphate reductoisomerase
Ligand
BDBM50028363
Substrate
Meas. Tech.
ChEMBL_1436199 (CHEMBL3386561)
IC50
140±n/a nM
Citation
 Konzuch, SUmeda, THeld, JHähn, SBrücher, KLienau, CBehrendt, CTGräwert, TBacher, AIllarionov, BFischer, MMordmüller, BTanaka, NKurz, T Binding modes of reverse fosmidomycin analogs toward the antimalarial target IspC. J Med Chem 57:8827-38 (2014)  
Target
Name:
1-deoxy-D-xylulose 5-phosphate reductoisomerase
Synonyms:
1-Deoxy-D-xylulose 5-phosphate reductoisomerase (DXP) 1-deoxy-D-xylulose 5-phosphate reductoisomerase (DXR) DXP reductoisomerase dxr yaeM
Type:
Protein
Mol. Mass.:
43384.52
Organism:
Escherichia coli
Description:
P45568
Residue:
398
  
Inhibitor
Name:
BDBM50028363
Synonyms:
CHEMBL3342259
Type:
Small organic molecule
Emp. Form.:
C11H16NO6P
Mol. Mass.:
289.2216
SMILES:
COc1ccc(cc1)C(CCC(=O)NO)P(O)(O)=O
: