Target
Serine/threonine-protein kinase B-raf
Ligand
BDBM50029085
Substrate
Meas. Tech.
ChEMBL_1435523 (CHEMBL3385343)
Ki
0.130000±n/a nM
Citation
 Wang, SFZhu, YLZhu, PTMakawana, JAZhang, YLZhao, MYLv, PCZhu, HL Design, synthesis and biological evaluation of novel 5-phenyl-1H-pyrazole derivatives as potential BRAF(V600E) inhibitors. Bioorg Med Chem 22:6201-8 (2014)  
Target
Name:
Serine/threonine-protein kinase B-raf
Synonyms:
B-RAF B-Raf proto-oncogene serine/threonine-protein kinase BRAF1 RAFB1 v-Raf murine sarcoma viral oncogene homolog B1
Type:
Serine/threonine-protein kinase
Mol. Mass.:
84446.00
Organism:
Homo sapiens (Human)
Description:
P15056
Residue:
766
  
Inhibitor
Name:
BDBM50029085
Synonyms:
CHEBI:83405 GDC-0879
Type:
Small organic molecule
Emp. Form.:
C19H18N4O2
Mol. Mass.:
334.3718
SMILES:
OCCn1cc(c(n1)-c1ccncc1)-c1ccc2\C(CCc2c1)=N\O
: