Target
Carbonic anhydrase 9
Ligand
BDBM50031588
Substrate
Meas. Tech.
ChEMBL_1441656 (CHEMBL3377633)
Kd
<10.0±n/a nM
Target
Name:
Carbonic anhydrase 9
Synonyms:
CA-IX CAH9_HUMAN Carbonic anhydrase 9 (CA IX) Carbonic anhydrase 9 precursor Carbonic anhydrase IX (CAIX) Carbonic anhydrases; II & IX MN RCC-associated antigen G250
Type:
Enzyme
Mol. Mass.:
49669.03
Organism:
Homo sapiens (Human)
Description:
Catalytic domain of human cloned isozyme was used in the assay
Residue:
459
  
Inhibitor
Name:
BDBM50031588
Synonyms:
CHEMBL3359181
Type:
Small organic molecule
Emp. Form.:
C16H23F3N2O5S2
Mol. Mass.:
444.489
SMILES:
NS(=O)(=O)c1c(F)c(F)c(c(NC2CCCCCCC2)c1F)S(=O)(=O)CCO
: